WS 140.163.4.242 Failed to send results

Moderators: Site Moderators, PandeGroup

WS 140.163.4.242 Failed to send results

Postby FldngForGrandparents » Wed Jun 07, 2017 2:48 am

2017-06-07:02:32:10:WU00:FS01:Sending unit results: id:00 state:SEND error:FAILED project:11402 run:9 clone:44 gen:221 core:0x21 unit:0x000001278ca304f255ed4eb34ecdfdb2
2017-06-07:02:32:10:WU00:FS01:Connecting to 140.163.4.242:8080
2017-06-07:02:32:10:WARNING:WU00:FS01:Exception: Failed to send results to work server: Transfer failed
2017-06-07:02:32:10:WU00:FS01:Trying to send results to collection server
2017-06-07:02:32:10:WU00:FS01:Connecting to 128.252.203.2:8080
2017-06-07:02:32:10:ERROR:WU00:FS01:Exception: Transfer failed
Image

Dedicated to my grandparents who have passed away from Alzheimer's

Dedicated folding rig on Ubuntu 14.04:
2 - GTX 980 OC +200
1 - GTX 980 Ti OC +20
4 - GTX 1070 FE OC +200
1 - GTX 1080 OC +140
1 - GTX 1080Ti OC +120
FldngForGrandparents
 
Posts: 63
Joined: Sun Feb 28, 2016 10:06 pm

Re: WS 140.163.4.242 Failed to send results

Postby bruce » Wed Jun 07, 2017 5:17 am

bruce
 
Posts: 21411
Joined: Thu Nov 29, 2007 10:13 pm
Location: So. Cal.

Re: WS 140.163.4.242 Failed to send results

Postby rwh202 » Wed Jun 07, 2017 6:21 am


Hopefully they've not taken them down a month early...
rwh202
 
Posts: 292
Joined: Mon Nov 15, 2010 8:51 pm
Location: South Coast, UK

Re: WS 140.163.4.242 Failed to send results

Postby Joe_H » Wed Jun 07, 2017 1:09 pm

June, July, they look similar and easily confused in a hurry.

As to the failure, too little of the log to guess, but the part of the message that says "error:FAILED" means the WU had already failed to successfully process to completion. The client was trying to send back that information. A section of log showing what had happened before this would be useful.
Image

iMac 2.8 i7 12 GB smp8, Mac Pro 2.8 quad 12 GB smp6
MacBook Pro 2.9 i7 8 GB smp3
Joe_H
Site Admin
 
Posts: 3885
Joined: Tue Apr 21, 2009 4:41 pm
Location: W. MA

Re: WS 140.163.4.242 Failed to send results

Postby FldngForGrandparents » Wed Jun 07, 2017 3:49 pm

Code: Select all
2017-06-07:01:14:43:   Compiler: GNU 4.4.7
2017-06-07:01:14:43:    Options: -std=gnu++98 -O3 -funroll-loops -mfpmath=sse -ffast-math
2017-06-07:01:14:43:             -fno-unsafe-math-optimizations -msse2
2017-06-07:01:14:43:   Platform: linux2 3.2.0-1-amd64
2017-06-07:01:14:43:       Bits: 64
2017-06-07:01:14:43:       Mode: Release
2017-06-07:01:14:43:************************** System **************************
2017-06-07:01:14:43:        CPU: Intel(R) Xeon(R) CPU X5670 @ 2.93GHz
2017-06-07:01:14:43:     CPU ID: GenuineIntel Family 6 Model 44 Stepping 2
2017-06-07:01:14:43:       CPUs: 12
2017-06-07:01:14:43:     Memory: 23.53GiB
2017-06-07:01:14:43:Free Memory: 22.27GiB
2017-06-07:01:14:43:    Threads: POSIX_THREADS
2017-06-07:01:14:43: OS Version: 4.4
2017-06-07:01:14:43:Has Battery: false
2017-06-07:01:14:43: On Battery: false
2017-06-07:01:14:43: UTC Offset: -7
2017-06-07:01:14:43:        PID: 2031
2017-06-07:01:14:43:        CWD: /var/lib/fahclient
2017-06-07:01:14:43:         OS: Linux 4.4.0-78-generic x86_64
2017-06-07:01:14:43:    OS Arch: AMD64
2017-06-07:01:14:43:       GPUs: 6
2017-06-07:01:14:43:      GPU 0: NVIDIA:7 GP104 [GeForce GTX 1080] 8873
2017-06-07:01:14:43:      GPU 1: UNSUPPORTED: NV3 [PCI]
2017-06-07:01:14:43:      GPU 2: NVIDIA:7 GP104 [GeForce GTX 1070] 6463
2017-06-07:01:14:43:      GPU 3: UNSUPPORTED: NV3 [PCI]
2017-06-07:01:14:43:      GPU 4: NVIDIA:7 GP104 [GeForce GTX 1070] 6463
2017-06-07:01:14:43:      GPU 5: UNSUPPORTED: NV3 [PCI]
2017-06-07:01:14:43:       CUDA: 6.1
2017-06-07:01:14:43:CUDA Driver: 8000
2017-06-07:01:14:43:************************************************************
2017-06-07:01:14:43:<config>
2017-06-07:01:14:43:  <!-- Client Control -->
2017-06-07:01:14:43:  <fold-anon v='true'/>
2017-06-07:01:14:43:
2017-06-07:01:14:43:  <!-- Folding Core -->
2017-06-07:01:14:43:  <core-priority v='low'/>
2017-06-07:01:14:43:
2017-06-07:01:14:43:  <!-- Folding Slot Configuration -->
2017-06-07:01:14:43:  <cause v='ALZHEIMERS'/>
2017-06-07:01:14:43:  <client-type v='advanced'/>
2017-06-07:01:14:43:
2017-06-07:01:14:43:  <!-- HTTP Server -->
2017-06-07:01:14:43:  <allow v='127.0.0.1 192.168.1.0/24'/>
2017-06-07:01:14:43:
2017-06-07:01:14:43:  <!-- Logging -->
2017-06-07:01:14:43:  <log-date v='true'/>
2017-06-07:01:14:43:
2017-06-07:01:14:43:  <!-- Network -->
2017-06-07:01:14:43:  <proxy v=':8080'/>
2017-06-07:01:14:43:
2017-06-07:01:14:43:  <!-- Remote Command Server -->
2017-06-07:01:14:43:  <password v='******'/>
2017-06-07:01:14:43:
2017-06-07:01:14:43:  <!-- Slot Control -->
2017-06-07:01:14:43:  <pause-on-battery v='false'/>
2017-06-07:01:14:43:  <power v='full'/>
2017-06-07:01:14:43:
2017-06-07:01:14:43:  <!-- User Information -->
2017-06-07:01:14:43:  <passkey v='********************************'/>
2017-06-07:01:14:43:  <team v='224497'/>
2017-06-07:01:14:43:  <user v='Serpent6877'/>
2017-06-07:01:14:43:
2017-06-07:01:14:43:  <!-- Work Unit Control -->
2017-06-07:01:14:43:  <next-unit-percentage v='100'/>
2017-06-07:01:14:43:
2017-06-07:01:14:43:  <!-- Folding Slots -->
2017-06-07:01:14:43:  <slot id='1' type='GPU'/>
2017-06-07:01:14:43:</config>
2017-06-07:01:14:43:Switching to user fahclient
2017-06-07:01:14:43:Trying to access database...
2017-06-07:01:14:43:Successfully acquired database lock
2017-06-07:01:14:43:Enabled folding slot 01: READY gpu:0:GP104 [GeForce GTX 1080] 8873
2017-06-07:01:14:43:WU01:FS01:Sending unit results: id:01 state:SEND error:NO_ERROR project:11408 run:68 clone:3 gen:10 core:0x21 unit:0x0000000d8ca304e95901269e25daf646
2017-06-07:01:14:43:WARNING:WU01:FS01:Produced no results, failing
2017-06-07:01:14:43:WU01:FS01:Connecting to 140.163.4.233:8080
2017-06-07:01:14:43:WU00:FS01:Starting
2017-06-07:01:14:43:WU00:FS01:Running FahCore: /usr/bin/FAHCoreWrapper /var/lib/fahclient/cores/fahwebx.stanford.edu/cores/Linux/AMD64/NVIDIA/Fermi/Core_21.fah/FahCore_21 -dir 00 -suffix 01 -version 704 -lifeline 2031 -checkpoint 15 -gpu 0 -gpu-vendor nvidia
2017-06-07:01:14:43:WU00:FS01:Started FahCore on PID 2041
2017-06-07:01:14:43:WU00:FS01:Core PID:2045
2017-06-07:01:14:43:WU00:FS01:FahCore 0x21 started
2017-06-07:01:14:44:WARNING:WU00:FS01:FahCore returned: FAILED_1 (0 = 0x0)
2017-06-07:01:14:44:WU00:FS01:Starting
2017-06-07:01:14:44:WU00:FS01:Running FahCore: /usr/bin/FAHCoreWrapper /var/lib/fahclient/cores/fahwebx.stanford.edu/cores/Linux/AMD64/NVIDIA/Fermi/Core_21.fah/FahCore_21 -dir 00 -suffix 01 -version 704 -lifeline 2031 -checkpoint 15 -gpu 0 -gpu-vendor nvidia
2017-06-07:01:14:44:WU00:FS01:Started FahCore on PID 2072
2017-06-07:01:14:44:WU00:FS01:Core PID:2076
2017-06-07:01:14:44:WU00:FS01:FahCore 0x21 started
2017-06-07:01:14:44:WU01:FS01:Server responded WORK_ACK (400)
2017-06-07:01:14:44:WU01:FS01:Final credit estimate, 9443.00 points
2017-06-07:01:14:44:WU01:FS01:Cleaning up
2017-06-07:01:14:44:WARNING:WU00:FS01:FahCore returned: FAILED_1 (0 = 0x0)
2017-06-07:01:15:44:WU00:FS01:Starting
2017-06-07:01:15:44:WU00:FS01:Running FahCore: /usr/bin/FAHCoreWrapper /var/lib/fahclient/cores/fahwebx.stanford.edu/cores/Linux/AMD64/NVIDIA/Fermi/Core_21.fah/FahCore_21 -dir 00 -suffix 01 -version 704 -lifeline 2031 -checkpoint 15 -gpu 0 -gpu-vendor nvidia
2017-06-07:01:15:44:WU00:FS01:Started FahCore on PID 2311
2017-06-07:01:15:44:WU00:FS01:Core PID:2315
2017-06-07:01:15:44:WU00:FS01:FahCore 0x21 started
2017-06-07:01:15:45:WARNING:WU00:FS01:FahCore returned: FAILED_1 (0 = 0x0)
2017-06-07:01:16:44:WU00:FS01:Starting
2017-06-07:01:16:44:WU00:FS01:Running FahCore: /usr/bin/FAHCoreWrapper /var/lib/fahclient/cores/fahwebx.stanford.edu/cores/Linux/AMD64/NVIDIA/Fermi/Core_21.fah/FahCore_21 -dir 00 -suffix 01 -version 704 -lifeline 2031 -checkpoint 15 -gpu 0 -gpu-vendor nvidia
2017-06-07:01:16:44:WU00:FS01:Started FahCore on PID 2371
2017-06-07:01:16:44:WU00:FS01:Core PID:2375
2017-06-07:01:16:44:WU00:FS01:FahCore 0x21 started
2017-06-07:01:16:45:WARNING:WU00:FS01:FahCore returned: FAILED_1 (0 = 0x0)
2017-06-07:01:17:44:WU00:FS01:Starting
2017-06-07:01:17:44:WU00:FS01:Running FahCore: /usr/bin/FAHCoreWrapper /var/lib/fahclient/cores/fahwebx.stanford.edu/cores/Linux/AMD64/NVIDIA/Fermi/Core_21.fah/FahCore_21 -dir 00 -suffix 01 -version 704 -lifeline 2031 -checkpoint 15 -gpu 0 -gpu-vendor nvidia
2017-06-07:01:17:44:WU00:FS01:Started FahCore on PID 2594
2017-06-07:01:17:44:WU00:FS01:Core PID:2598
2017-06-07:01:17:44:WU00:FS01:FahCore 0x21 started
2017-06-07:01:17:45:WARNING:WU00:FS01:FahCore returned: FAILED_1 (0 = 0x0)
2017-06-07:01:17:45:WARNING:WU00:FS01:Too many errors, failing
2017-06-07:01:17:45:WU00:FS01:Sending unit results: id:00 state:SEND error:FAILED project:11402 run:9 clone:44 gen:221 core:0x21 unit:0x000001278ca304f255ed4eb34ecdfdb2
2017-06-07:01:17:45:WU00:FS01:Connecting to 140.163.4.242:8080
2017-06-07:01:17:45:WARNING:WU00:FS01:Exception: Failed to send results to work server: Transfer failed
2017-06-07:01:17:45:WU00:FS01:Trying to send results to collection server
2017-06-07:01:17:45:WU00:FS01:Connecting to 128.252.203.2:8080
2017-06-07:01:17:45:ERROR:WU00:FS01:Exception: Transfer failed
2017-06-07:01:17:45:WU00:FS01:Sending unit results: id:00 state:SEND error:FAILED project:11402 run:9 clone:44 gen:221 core:0x21 unit:0x000001278ca304f255ed4eb34ecdfdb2
2017-06-07:01:17:45:WU00:FS01:Connecting to 140.163.4.242:8080
2017-06-07:01:17:45:WARNING:WU00:FS01:Exception: Failed to send results to work server: Transfer failed
2017-06-07:01:17:45:WU00:FS01:Trying to send results to collection server
2017-06-07:01:17:45:WU00:FS01:Connecting to 128.252.203.2:8080
2017-06-07:01:17:45:WU01:FS01:Connecting to 171.67.108.45:80
2017-06-07:01:17:45:ERROR:WU00:FS01:Exception: Transfer failed
2017-06-07:01:17:46:WU01:FS01:Assigned to work server 140.163.4.232
2017-06-07:01:17:46:WU01:FS01:Requesting new work unit for slot 01: READY gpu:0:GP104 [GeForce GTX 1080] 8873 from 140.163.4.232
2017-06-07:01:17:46:WU01:FS01:Connecting to 140.163.4.232:8080
2017-06-07:01:17:46:WU01:FS01:Downloading 12.31MiB
2017-06-07:01:17:52:WU01:FS01:Download 97.97%
2017-06-07:01:17:52:WU01:FS01:Download complete
2017-06-07:01:17:52:WU01:FS01:Received Unit: id:01 state:DOWNLOAD error:NO_ERROR project:11804 run:0 clone:176 gen:0 core:0x21 unit:0x000000008ca304e8582a2b95988a254d
2017-06-07:01:17:52:WU01:FS01:Starting
2017-06-07:01:17:52:WU01:FS01:Running FahCore: /usr/bin/FAHCoreWrapper /var/lib/fahclient/cores/fahwebx.stanford.edu/cores/Linux/AMD64/NVIDIA/Fermi/Core_21.fah/FahCore_21 -dir 01 -suffix 01 -version 704 -lifeline 2031 -checkpoint 15 -gpu 0 -gpu-vendor nvidia
2017-06-07:01:17:52:WU01:FS01:Started FahCore on PID 2607
2017-06-07:01:17:52:WU01:FS01:Core PID:2611
2017-06-07:01:17:52:WU01:FS01:FahCore 0x21 started
2017-06-07:01:17:52:WU01:FS01:0x21:*********************** Log Started 2017-06-07T01:17:52Z ***********************
2017-06-07:01:17:52:WU01:FS01:0x21:Project: 11804 (Run 0, Clone 176, Gen 0)
2017-06-07:01:17:52:WU01:FS01:0x21:Unit: 0x000000008ca304e8582a2b95988a254d
2017-06-07:01:17:52:WU01:FS01:0x21:CPU: 0x00000000000000000000000000000000
2017-06-07:01:17:52:WU01:FS01:0x21:Machine: 1
2017-06-07:01:17:52:WU01:FS01:0x21:Reading tar file core.xml
2017-06-07:01:17:52:WU01:FS01:0x21:Reading tar file integrator.xml
2017-06-07:01:17:52:WU01:FS01:0x21:Reading tar file state.xml
2017-06-07:01:17:52:WU01:FS01:0x21:Reading tar file system.xml
2017-06-07:01:17:52:WU01:FS01:0x21:Digital signatures verified
2017-06-07:01:17:52:WU01:FS01:0x21:Folding@home GPU Core21 Folding@home Core
2017-06-07:01:17:52:WU01:FS01:0x21:Version 0.0.18
2017-06-07:01:17:57:WU01:FS01:0x21:Completed 0 out of 5000000 steps (0%)
2017-06-07:01:17:57:WU01:FS01:0x21:Temperature control disabled. Requirements: single Nvidia GPU, tmax must be < 110 and twait >= 900
2017-06-07:01:18:27:WU01:FS01:0x21:Completed 50000 out of 5000000 steps (1%)
2017-06-07:01:18:45:WU00:FS01:Sending unit results: id:00 state:SEND error:FAILED project:11402 run:9 clone:44 gen:221 core:0x21 unit:0x000001278ca304f255ed4eb34ecdfdb2
2017-06-07:01:18:45:WU00:FS01:Connecting to 140.163.4.242:8080
2017-06-07:01:18:45:WARNING:WU00:FS01:Exception: Failed to send results to work server: Transfer failed
2017-06-07:01:18:45:WU00:FS01:Trying to send results to collection server
2017-06-07:01:18:45:WU00:FS01:Connecting to 128.252.203.2:8080
2017-06-07:01:18:45:ERROR:WU00:FS01:Exception: Transfer failed
2017-06-07:01:18:58:WU01:FS01:0x21:Completed 100000 out of 5000000 steps (2%)
2017-06-07:01:19:29:WU01:FS01:0x21:Completed 150000 out of 5000000 steps (3%)
2017-06-07:01:19:59:WU01:FS01:0x21:Completed 200000 out of 5000000 steps (4%)
2017-06-07:01:20:22:WU00:FS01:Sending unit results: id:00 state:SEND error:FAILED project:11402 run:9 clone:44 gen:221 core:0x21 unit:0x000001278ca304f255ed4eb34ecdfdb2
2017-06-07:01:20:22:WU00:FS01:Connecting to 140.163.4.242:8080
2017-06-07:01:20:23:WARNING:WU00:FS01:Exception: Failed to send results to work server: Transfer failed
2017-06-07:01:20:23:WU00:FS01:Trying to send results to collection server
2017-06-07:01:20:23:WU00:FS01:Connecting to 128.252.203.2:8080
2017-06-07:01:20:23:ERROR:WU00:FS01:Exception: Transfer failed
2017-06-07:01:20:30:WU01:FS01:0x21:Completed 250000 out of 5000000 steps (5%)
2017-06-07:01:21:01:WU01:FS01:0x21:Completed 300000 out of 5000000 steps (6%)
2017-06-07:01:21:32:WU01:FS01:0x21:Completed 350000 out of 5000000 steps (7%)
2017-06-07:01:22:03:WU01:FS01:0x21:Completed 400000 out of 5000000 steps (8%)
2017-06-07:01:22:33:WU01:FS01:0x21:Completed 450000 out of 5000000 steps (9%)
2017-06-07:01:23:00:WU00:FS01:Sending unit results: id:00 state:SEND error:FAILED project:11402 run:9 clone:44 gen:221 core:0x21 unit:0x000001278ca304f255ed4eb34ecdfdb2
2017-06-07:01:23:00:WU00:FS01:Connecting to 140.163.4.242:8080
2017-06-07:01:23:00:WARNING:WU00:FS01:Exception: Failed to send results to work server: Transfer failed
2017-06-07:01:23:00:WU00:FS01:Trying to send results to collection server
2017-06-07:01:23:00:WU00:FS01:Connecting to 128.252.203.2:8080
2017-06-07:01:23:00:ERROR:WU00:FS01:Exception: Transfer failed
2017-06-07:01:23:04:WU01:FS01:0x21:Completed 500000 out of 5000000 steps (10%)
2017-06-07:01:23:35:WU01:FS01:0x21:Completed 550000 out of 5000000 steps (11%)
2017-06-07:01:24:06:WU01:FS01:0x21:Completed 600000 out of 5000000 steps (12%)
2017-06-07:01:24:37:WU01:FS01:0x21:Completed 650000 out of 5000000 steps (13%)
2017-06-07:01:25:07:WU01:FS01:0x21:Completed 700000 out of 5000000 steps (14%)
2017-06-07:01:25:39:WU01:FS01:0x21:Completed 750000 out of 5000000 steps (15%)
2017-06-07:01:26:10:WU01:FS01:0x21:Completed 800000 out of 5000000 steps (16%)
2017-06-07:01:26:41:WU01:FS01:0x21:Completed 850000 out of 5000000 steps (17%)
2017-06-07:01:27:12:WU01:FS01:0x21:Completed 900000 out of 5000000 steps (18%)
2017-06-07:01:27:14:WU00:FS01:Sending unit results: id:00 state:SEND error:FAILED project:11402 run:9 clone:44 gen:221 core:0x21 unit:0x000001278ca304f255ed4eb34ecdfdb2
2017-06-07:01:27:14:WU00:FS01:Connecting to 140.163.4.242:8080
2017-06-07:01:27:14:WARNING:WU00:FS01:Exception: Failed to send results to work server: Transfer failed
2017-06-07:01:27:14:WU00:FS01:Trying to send results to collection server
2017-06-07:01:27:14:WU00:FS01:Connecting to 128.252.203.2:8080
2017-06-07:01:27:14:ERROR:WU00:FS01:Exception: Transfer failed
2017-06-07:01:27:43:WU01:FS01:0x21:Completed 950000 out of 5000000 steps (19%)
2017-06-07:01:28:13:WU01:FS01:0x21:Completed 1000000 out of 5000000 steps (20%)
2017-06-07:01:28:45:WU01:FS01:0x21:Completed 1050000 out of 5000000 steps (21%)
2017-06-07:01:29:15:WU01:FS01:0x21:Completed 1100000 out of 5000000 steps (22%)
2017-06-07:01:29:46:WU01:FS01:0x21:Completed 1150000 out of 5000000 steps (23%)
2017-06-07:01:30:17:WU01:FS01:0x21:Completed 1200000 out of 5000000 steps (24%)
2017-06-07:01:30:47:WU01:FS01:0x21:Completed 1250000 out of 5000000 steps (25%)
2017-06-07:01:31:19:WU01:FS01:0x21:Completed 1300000 out of 5000000 steps (26%)
2017-06-07:01:31:50:WU01:FS01:0x21:Completed 1350000 out of 5000000 steps (27%)
2017-06-07:01:32:20:WU01:FS01:0x21:Completed 1400000 out of 5000000 steps (28%)
2017-06-07:01:32:51:WU01:FS01:0x21:Completed 1450000 out of 5000000 steps (29%)
2017-06-07:01:33:22:WU01:FS01:0x21:Completed 1500000 out of 5000000 steps (30%)
2017-06-07:01:33:53:WU01:FS01:0x21:Completed 1550000 out of 5000000 steps (31%)
2017-06-07:01:34:05:WU00:FS01:Sending unit results: id:00 state:SEND error:FAILED project:11402 run:9 clone:44 gen:221 core:0x21 unit:0x000001278ca304f255ed4eb34ecdfdb2
2017-06-07:01:34:05:WU00:FS01:Connecting to 140.163.4.242:8080
2017-06-07:01:34:06:WARNING:WU00:FS01:Exception: Failed to send results to work server: Transfer failed
2017-06-07:01:34:06:WU00:FS01:Trying to send results to collection server
2017-06-07:01:34:06:WU00:FS01:Connecting to 128.252.203.2:8080
2017-06-07:01:34:06:ERROR:WU00:FS01:Exception: Transfer failed
2017-06-07:01:34:24:WU01:FS01:0x21:Completed 1600000 out of 5000000 steps (32%)


FldngForGrandparents
 
Posts: 63
Joined: Sun Feb 28, 2016 10:06 pm

Re: WS 140.163.4.242 Failed to send results

Postby Joe_H » Wed Jun 07, 2017 4:23 pm

From looking at this log, whatever happened to WU00 occurred prior to the last restart of FAHClinet and would appear in an older log. The WU may have been corrupted in a too fast shutdown/crash of your system or something similar. At this point probably about the only way to clear this up will be to manually dump WU00.

You would need to pause folding, navigate to the work directory and remove the 00 folder. Then resume folding. The client should find the files missing and clean up the folding slot.
Joe_H
Site Admin
 
Posts: 3885
Joined: Tue Apr 21, 2009 4:41 pm
Location: W. MA

Re: WS 140.163.4.242 Failed to send results

Postby bruce » Wed Jun 07, 2017 4:25 pm

Joe_H wrote:June, July, they look similar and easily confused in a hurry.


Well, somewhere along the line there was some confusion and I, for one, didn't even notice. (I just copied the dates from an earlier announcement.)

Based on the reported status of the servers at Stanford the campus is mostly dark, running on emergency power only, and this is June 6-7, not July 6-7. The servers at FAH's remote sites appear to be functional and with a few exceptions, the collection servers seem to be accepting results but assignment servers are not dishing out new assignments. (All the AS are at Stanford, and if they're all off-line, this takes down the entire assignment process.

My expectation is that the electrical crew will finish their work some time this afternoon and FAH services will come back on-line, one piece at a time.
bruce
 
Posts: 21411
Joined: Thu Nov 29, 2007 10:13 pm
Location: So. Cal.

Re: WS 140.163.4.242 Failed to send results

Postby ComputerGenie » Wed Jun 07, 2017 11:53 pm

bruce wrote:...(All the AS are at Stanford, and if they're all off-line, this takes down the entire assignment process.

My expectation is that the electrical crew will finish their work some time this afternoon and FAH services will come back on-line, one piece at a time.


I'm glad you added that, because I have an issue with the same IP not assigning to a shiny, new 1080 Ti. :(
User avatar
ComputerGenie
 
Posts: 242
Joined: Mon Dec 12, 2016 4:06 am

Re: WS 140.163.4.242 Failed to send results

Postby bruce » Fri Jun 09, 2017 1:43 am

ComputerGenie wrote:... I have an issue with the same IP not assigning to a shiny, new 1080 Ti. :(

A day later, I'd expect everything to be back on-line (though have not checked). If it's still a problem, fill us in on the details.
bruce
 
Posts: 21411
Joined: Thu Nov 29, 2007 10:13 pm
Location: So. Cal.


Return to Issues with a specific server

Who is online

Users browsing this forum: Google [Bot] and 2 guests

cron