upload failed: 3.21.157.11 & 3.133.76.19 for project 16434

Moderators: Site Moderators, FAHC Science Team

upload failed: 3.21.157.11 & 3.133.76.19 for project 16434

Postby ursmii » Tue Apr 28, 2020 10:12 am

since 3 hours all transfer to 3.21.157.11 & 3.133.76.19 failed for project 16434

05:24:35:WARNING:WU02:FS01:Exception: Failed to send results to work server: Transfer failed
05:24:35:WU02:FS01:Trying to send results to collection server
05:24:35:WU02:FS01:Uploading 140.41MiB to 3.21.157.11

05:24:36:WU02:FS01:Uploading 140.41MiB to 3.133.76.19
05:24:36:WU02:FS01:Connecting to 3.133.76.19:8080
05:24:42:WU02:FS01:Upload 0.13%
05:24:42:WARNING:WU02:FS01:Exception: Failed to send results to work server: Transfer failed
05:24:42:WU02:FS01:Trying to send results to collection server
05:24:42:WU02:FS01:Uploading 140.41MiB to 3.21.157.11
05:24:42:WU02:FS01:Connecting to 3.21.157.11:8080
05:24:42:ERROR:WU02:FS01:Exception: Transfer failed

05:25:56:WARNING:WU02:FS01:Exception: Failed to send results to work server: Transfer failed
05:25:56:WU02:FS01:Trying to send results to collection server
05:25:56:WU02:FS01:Uploading 140.41MiB to 3.21.157.11
05:25:56:WU02:FS01:Connecting to 3.21.157.11:8080
05:25:56:ERROR:WU02:FS01:Exception: Transfer failed

05:27:13:WU02:FS01:Connecting to 3.133.76.19:8080
05:27:44:WU02:FS01:Upload 0.13%
05:27:44:WARNING:WU02:FS01:Exception: Failed to send results to work server: Transfer failed
05:27:44:WU02:FS01:Trying to send results to collection server
05:27:44:WU02:FS01:Uploading 140.41MiB to 3.21.157.11
05:27:44:WU02:FS01:Connecting to 3.21.157.11:8080
05:27:45:ERROR:WU02:FS01:Exception: Transfer failed

06:28:09:WU02:FS01:Uploading 140.41MiB to 3.21.157.11
06:28:09:WU02:FS01:Connecting to 3.21.157.11:8080
06:28:09:ERROR:WU02:FS01:Exception: Transfer failed
06:28:09:WU02:FS01:Sending unit results: id:02 state:SEND error:NO_ERROR project:16434 run:314 clone:2 gen:4 core:0x22 unit:0x0000000503854c135e9cbaccb53bdf19
06:28:09:WU02:FS01:Uploading 140.41MiB to 3.133.76.19
06:28:09:WU02:FS01:Connecting to 3.133.76.19:8080
06:28:25:WU02:FS01:Upload 0.09%

08:26:27:WU02:FS01:Sending unit results: id:02 state:SEND error:NO_ERROR project:16434 run:314 clone:2 gen:4 core:0x22 unit:0x0000000503854c135e9cbaccb53bdf19
08:26:27:WU02:FS01:Uploading 140.41MiB to 3.133.76.19
08:26:27:WU02:FS01:Connecting to 3.133.76.19:8080
08:27:00:WU02:FS01:Upload 0.13%
08:27:00:WARNING:WU02:FS01:Exception: Failed to send results to work server: Transfer failed
08:27:00:WU02:FS01:Trying to send results to collection server
08:27:00:WU02:FS01:Uploading 140.41MiB to 3.21.157.11
08:27:00:WU02:FS01:Connecting to 3.21.157.11:8080
08:27:00:ERROR:WU02:FS01:Exception: Transfer failed

08:48:59:WU02:FS01:Sending unit results: id:02 state:SEND error:NO_ERROR project:16434 run:314 clone:2 gen:4 core:0x22 unit:0x0000000503854c135e9cbaccb53bdf19
08:49:00:WU02:FS01:Uploading 140.41MiB to 3.133.76.19
08:49:00:WU02:FS01:Connecting to 3.133.76.19:8080
08:49:21:WARNING:WU02:FS01:WorkServer connection failed on port 8080 trying 80
08:49:21:WU02:FS01:Connecting to 3.133.76.19:80
08:49:24:WU02:FS01:Upload 0.04%
08:49:41:WU01:FS01:0x22:Completed 170000 out of 1000000 steps (17%)
08:49:50:WU02:FS01:Upload 0.13%
08:49:51:WARNING:WU02:FS01:Exception: Failed to send results to work server: Transfer failed
08:49:51:WU02:FS01:Trying to send results to collection server
08:49:51:WU02:FS01:Uploading 140.41MiB to 3.21.157.11
08:49:51:WU02:FS01:Connecting to 3.21.157.11:8080
08:49:51:ERROR:WU02:FS01:Exception: Transfer failed
-------------------------------------------------------------------------------------------------
for an other project 14437 the upload was successful
09:00:22:WU04:FS02:Uploading 93.04MiB to 3.133.76.19
09:00:22:WU00:FS02:Starting
09:00:22:WU04:FS02:Connecting to 3.133.76.19:8080
09:00:37:WU04:FS02:Upload 0.07%
...
09:04:49:WU04:FS02:Upload 97.68%
09:04:54:WU04:FS02:Upload complete
09:04:54:WU04:FS02:Server responded WORK_ACK (400)
09:04:54:WU04:FS02:Final credit estimate, 375498.00 points
AMD Ryzen 3950X, EVGA 2080 TI FTW3, Gigabyte X570 Aorus xtreme, G.Skill TridentZneo (4x16GB, DDR4-3600), Corsair MP600 (1000GB, M.2 2280), CoolerMaster H500P Mesh, beQuiet DarkRock pro 4, Win10 pro, F@H, R@H & dist.comp (Moo!Wrapper, Milkyway)
Image
ursmii
 
Posts: 5
Joined: Fri Mar 27, 2020 4:19 pm

Re: upload failed: 3.21.157.11 & 3.133.76.19 for project 164

Postby Neil-B » Tue Apr 28, 2020 10:21 am

Please see https://foldingforum.org/viewtopic.php?f=18&t=34744 and https://foldingforum.org/viewtopic.php?f=19&t=34891 along with other similar topics... This is a known issue and is being worked on.
1: 2x Xeon E5-2697v3@2.60GHz, 512GB DDR4 LRDIMM, SSD Raid, Win10 Ent, Quadro K420 1GB, FAH 7.6.13
2: Xeon E3-1505Mv5@2.80GHz, 32GB DDR4, NVME, Win10 Pro, Quadro M1000M 2GB, FAH 7.6.13
3: i7-960@3.20GHz, 12GB DDR3, SSD, Win10 Pro, GTX 750Ti 2GB, FAH 7.6.13
Neil-B
 
Posts: 1342
Joined: Sun Mar 22, 2020 6:52 pm
Location: UK

Re: upload failed: 3.21.157.11 & 3.133.76.19 for project 164

Postby ursmii » Tue Apr 28, 2020 1:57 pm

lost half of the credit and counting down.
what happens if it reaches zero?
ursmii
 
Posts: 5
Joined: Fri Mar 27, 2020 4:19 pm

Re: upload failed: 3.21.157.11 & 3.133.76.19 for project 164

Postby Neil-B » Tue Apr 28, 2020 2:17 pm

When the WU reaches "Timeout" then from then until the "Expiration Deadline" it will simply be worth Base Credits … If (and I really hope it doesn't) it gets to the expiration point then the client will delete the WU as it ceases to have scientific value.
Neil-B
 
Posts: 1342
Joined: Sun Mar 22, 2020 6:52 pm
Location: UK


Return to Issues with a specific server

Who is online

Users browsing this forum: No registered users and 1 guest

cron